Reaction Details
TargetBeta-1 adrenergic receptor
LigandBDBM50092031
Substrate/Competitorn/a
Meas. Tech.ChEBML_37262
IC50 40000±n/a nM
Citation Brockunier, LLParmee, EROk, HOCandelore, MRCascieri, MAColwell, LFDeng, LFeeney, WPForrest, MJHom, GJMacIntyre, DETota, LWyvratt, MJFisher, MHWeber, AE Human beta3-adrenergic receptor agonists containing 1,2,3-triazole-substituted benzenesulfonamides. Bioorg Med Chem Lett10:2111-4 (2000) Beta-1 adrenergic receptor
Name:Beta-1 adrenergic receptor
Type:G Protein-Coupled Receptor (GPCR)
Mol. Mass.:51338.40
Organism:Homo sapiens (Human)
Description:P08588
Residue:477
BDBM50092031
NameBDBM50092031
Synonyms:4-[4-(4-Fluoro-phenyl)-[1,2,3]triazol-2-yl]-N-{4-[2-((R)-2-hydroxy-2-pyridin-3-yl-ethylamino)-ethyl]-phenyl}-benzenesulfonamide | CHEMBL305558
TypeSmall organic molecule
Emp. Form.C29H27FN6O3S
Mol. Mass.558.626
SMILESO[C@@H](CNCCc1ccc(NS(=O)(=O)c2ccc(cc2)-n2ncc(n2)-c2ccc(F)cc2)cc1)c1cccnc1