Reaction Details
TargetMetabotropic glutamate receptor 5
LigandBDBM50536709
Substrate/Competitorn/a
Meas. Tech.ChEMBL_1934141 (CHEMBL4479793)
Ki 1.9±n/a nM
Citation Huang, HDegnan, APBalakrishnan, AEaston, AGulianello, MHuang, YMatchett, MMattson, GMiller, RSantone, KSSenapati, AShields, EESivarao, DVSnyder, LBWestphal, RWhiterock, VJYang, FBronson, JJMacor, JE Oxazolidinone-based allosteric modulators of mGluR5: Defining molecular switches to create a pharmacological tool box. Bioorg Med Chem Lett26:4165-9 (2016) 
 
Metabotropic glutamate receptor 5
Name:Metabotropic glutamate receptor 5
Type:Enzyme
Mol. Mass.:132484.72
Organism:Homo sapiens (Human)
Description:n/a
Residue:1212
BDBM50536709
NameBDBM50536709
Synonyms:CHEMBL4537236
TypeSmall organic molecule
Emp. Form.C22H15FN2O2
Mol. Mass.358.3651
SMILESFc1ccccc1[C@H]1OC(=O)N[C@@H]1c1cncc(c1)C#Cc1ccccc1