Reaction Details
TargetMetabotropic glutamate receptor 5
LigandBDBM50536702
Substrate/Competitorn/a
Meas. Tech.ChEMBL_1934141 (CHEMBL4479793)
Ki 1.8±n/a nM
Citation Huang, HDegnan, APBalakrishnan, AEaston, AGulianello, MHuang, YMatchett, MMattson, GMiller, RSantone, KSSenapati, AShields, EESivarao, DVSnyder, LBWestphal, RWhiterock, VJYang, FBronson, JJMacor, JE Oxazolidinone-based allosteric modulators of mGluR5: Defining molecular switches to create a pharmacological tool box. Bioorg Med Chem Lett26:4165-9 (2016) 
 
Metabotropic glutamate receptor 5
Name:Metabotropic glutamate receptor 5
Type:Enzyme
Mol. Mass.:132484.72
Organism:Homo sapiens (Human)
Description:n/a
Residue:1212
BDBM50536702
NameBDBM50536702
Synonyms:CHEMBL4554515
TypeSmall organic molecule
Emp. Form.C22H14F2N2O2
Mol. Mass.376.3556
SMILESFc1cccc([C@H]2OC(=O)N[C@@H]2c2cncc(c2)C#Cc2ccccc2)c1F