Reaction Details
TargetMetabotropic glutamate receptor 5
LigandBDBM50536715
Substrate/Competitorn/a
Meas. Tech.ChEMBL_1934141 (CHEMBL4479793)
Ki 16±n/a nM
Citation Huang, HDegnan, APBalakrishnan, AEaston, AGulianello, MHuang, YMatchett, MMattson, GMiller, RSantone, KSSenapati, AShields, EESivarao, DVSnyder, LBWestphal, RWhiterock, VJYang, FBronson, JJMacor, JE Oxazolidinone-based allosteric modulators of mGluR5: Defining molecular switches to create a pharmacological tool box. Bioorg Med Chem Lett26:4165-9 (2016) 
 
Metabotropic glutamate receptor 5
Name:Metabotropic glutamate receptor 5
Type:Enzyme
Mol. Mass.:132484.72
Organism:Homo sapiens (Human)
Description:n/a
Residue:1212
BDBM50536715
NameBDBM50536715
Synonyms:CHEMBL4578429
TypeSmall organic molecule
Emp. Form.C21H14FN3O2
Mol. Mass.359.3532
SMILESFc1ccc(cc1)[C@H]1OC(=O)N[C@@H]1c1cncc(c1)C#Cc1ccncc1