Reaction Details
TargetMetabotropic glutamate receptor 5
LigandBDBM50536720
Substrate/Competitorn/a
Meas. Tech.ChEMBL_1934145 (CHEMBL4479797)
Ki 8.9±n/a nM
Citation Huang, HDegnan, APBalakrishnan, AEaston, AGulianello, MHuang, YMatchett, MMattson, GMiller, RSantone, KSSenapati, AShields, EESivarao, DVSnyder, LBWestphal, RWhiterock, VJYang, FBronson, JJMacor, JE Oxazolidinone-based allosteric modulators of mGluR5: Defining molecular switches to create a pharmacological tool box. Bioorg Med Chem Lett26:4165-9 (2016) 
 
Metabotropic glutamate receptor 5
Name:Metabotropic glutamate receptor 5
Type:Enzyme
Mol. Mass.:132484.72
Organism:Homo sapiens (Human)
Description:n/a
Residue:1212
BDBM50536720
NameBDBM50536720
Synonyms:CHEMBL4516570
TypeSmall organic molecule
Emp. Form.C23H17NO2
Mol. Mass.339.3866
SMILESO=C1N[C@@H]([C@H](O1)c1ccccc1)c1cccc(c1)C#Cc1ccccc1