Reaction Details
TargetMetabotropic glutamate receptor 5
LigandBDBM50536708
Substrate/Competitorn/a
Meas. Tech.ChEMBL_1934141 (CHEMBL4479793)
Ki 2.1±n/a nM
Citation Huang, HDegnan, APBalakrishnan, AEaston, AGulianello, MHuang, YMatchett, MMattson, GMiller, RSantone, KSSenapati, AShields, EESivarao, DVSnyder, LBWestphal, RWhiterock, VJYang, FBronson, JJMacor, JE Oxazolidinone-based allosteric modulators of mGluR5: Defining molecular switches to create a pharmacological tool box. Bioorg Med Chem Lett26:4165-9 (2016) 
 
Metabotropic glutamate receptor 5
Name:Metabotropic glutamate receptor 5
Type:Enzyme
Mol. Mass.:132484.72
Organism:Homo sapiens (Human)
Description:n/a
Residue:1212
BDBM50536708
NameBDBM50536708
Synonyms:CHEMBL4556501
TypeSmall organic molecule
Emp. Form.C22H16N2O2
Mol. Mass.340.3746
SMILESO=C1N[C@@H]([C@H](O1)c1ccccc1)c1ccnc(c1)C#Cc1ccccc1