Reaction Details
TargetKappa-type opioid receptor
LigandBDBM50092513
Substrate/Competitorn/a
Meas. Tech.ChEMBL_145389 (CHEMBL750079)
Ki 1980±n/a nM
Citation Siener, TCambareri, AKuhl, UEnglberger, WHaurand, MKögel, BHolzgrabe, U Synthesis and opioid receptor affinity of a series of 2, 4-diaryl-substituted 3,7-diazabicylononanones. J Med Chem43:3746-51 (2000) Kappa-type opioid receptor
Name:Kappa-type opioid receptor
Type:G Protein-Coupled Receptor (GPCR)
Mol. Mass.:42648.76
Organism:Homo sapiens (Human)
Description:P41145
Residue:380
BDBM50092513
NameBDBM50092513
Synonyms:3-((4-Chloro-phenyl)-{[(4-chloro-phenyl)-ethoxycarbonyl-methyl]-methyl-amino}-methyl)-1-methyl-4-oxo-piperidine-3-carboxylic acid ethyl ester | CHEMBL366367
TypeSmall organic molecule
Emp. Form.C27H30Cl2N2O5
Mol. Mass.533.444
SMILESCCOC(=O)C12CN(C)CC(C(N(C)C1c1ccc(Cl)cc1)c1ccc(Cl)cc1)(C(=O)OCC)C2=O