Reaction Details
TargetAdenosine receptor A3
LigandBDBM50176050
Substrate/Competitorn/a
Meas. Tech.ChEMBL_1936018 (CHEMBL4481777)
Ki 4470±n/a nM
Citation Za?uski, MSchabikowski, JSchlenk, MOlejarz-Maciej, AKubas, BKarcz, TKuder, KLatacz, GZygmunt, MSynak, DHinz, SMüller, CEKie?-Kononowicz, K Novel multi-target directed ligands based on annelated xanthine scaffold with aromatic substituents acting on adenosine receptor and monoamine oxidase B. Synthesis, in vitro and in silico studies. Bioorg Med Chem27:1195-1210 (2019) 
 
Adenosine receptor A3
Name:Adenosine receptor A3
Type:G Protein-Coupled Receptor (GPCR)
Mol. Mass.:36197.32
Organism:Homo sapiens (Human)
Description:P0DMS8
Residue:318
BDBM50176050
NameBDBM50176050
Synonyms:8-(3,4-dimethoxystyryl)-1,3-diethyl-7-methyl-1H-purine-2,6(3H,7H)-dione 8-[2-(3,4-dimethoxy-phenyl)-vinyl]-1,3-diethyl-7-methyl-3,9-dihydro-purine-2,6-dione US11806350, Compound Istradefylline | istradefylline
TypeSmall organic molecule
Emp. Form.C20H24N4O4
Mol. Mass.384.429
SMILESCCn1c2nc(\C=C\c3ccc(OC)c(OC)c3)n(C)c2c(=O)n(CC)c1=O