Reaction Details
TargetGrowth hormone secretagogue receptor type 1
LigandBDBM50094055
Substrate/Competitorn/a
Meas. Tech.ChEMBL_72514 (CHEMBL685179)
IC50 55±n/a nM
Citation Bednarek, MAFeighner, SDPong, SSMcKee, KKHreniuk, DLSilva, MVWarren, VAHoward, ADVan Der Ploeg, LHHeck, JV Structure-function studies on the new growth hormone-releasing peptide, ghrelin: minimal sequence of ghrelin necessary for activation of growth hormone secretagogue receptor 1a. J Med Chem43:4370-6 (2000) Growth hormone secretagogue receptor type 1
Name:Growth hormone secretagogue receptor type 1
Type:Receptor
Mol. Mass.:41334.57
Organism:Homo sapiens (Human)
Description:Receptor binding studies use plasma membranes from LLC PK-1 cells transiently transfected with hGHSR1a.
Residue:366
BDBM50094055
NameBDBM50094055
Synonyms:CHEMBL422461 | GSS(heptyl carbonyl)FL-NH2
TypeSmall organic molecule
Emp. Form.C31H50N6O8
Mol. Mass.634.7641
SMILESCCCCCCCC(=O)OC[C@H](NC(=O)[C@H](CO)NC(=O)CN)C(=O)N[C@@H](Cc1ccccc1)C(=O)N[C@@H](CC(C)C)C(N)=O