Reaction Details
TargetGrowth hormone secretagogue receptor type 1
LigandBDBM50094064
Substrate/Competitorn/a
Meas. Tech.ChEMBL_72514 (CHEMBL685179)
IC50 889±n/a nM
Citation Bednarek, MAFeighner, SDPong, SSMcKee, KKHreniuk, DLSilva, MVWarren, VAHoward, ADVan Der Ploeg, LHHeck, JV Structure-function studies on the new growth hormone-releasing peptide, ghrelin: minimal sequence of ghrelin necessary for activation of growth hormone secretagogue receptor 1a. J Med Chem43:4370-6 (2000) Growth hormone secretagogue receptor type 1
Name:Growth hormone secretagogue receptor type 1
Type:Receptor
Mol. Mass.:41334.57
Organism:Homo sapiens (Human)
Description:Receptor binding studies use plasma membranes from LLC PK-1 cells transiently transfected with hGHSR1a.
Residue:366
BDBM50094064
NameBDBM50094064
Synonyms:CHEMBL335799 | GSS(heptyl carbonyl)F-NH2
TypeSmall organic molecule
Emp. Form.C25H39N5O7
Mol. Mass.521.6065
SMILESCCCCCCCC(=O)OC[C@H](NC(=O)[C@H](CO)NC(=O)CN)C(=O)N[C@@H](Cc1ccccc1)C(N)=O