Reaction Details
TargetCoagulation factor X
LigandBDBM12775
Substrate/Competitorn/a
Meas. Tech.ChEMBL_48950 (CHEMBL661663)
Ki 6±n/a nM
Citation Han, QDominguez, CStouten, PFPark, JMDuffy, DEGalemmo, RARossi, KAAlexander, RSSmallwood, AMWong, PCWright, MMLuettgen, JMKnabb, RMWexler, RR Design, synthesis, and biological evaluation of potent and selective amidino bicyclic factor Xa inhibitors. J Med Chem43:4398-415 (2000) Coagulation factor X
Name:Coagulation factor X
Type:Enzyme
Mol. Mass.:54726.60
Organism:Homo sapiens (Human)
Description:n/a
Residue:488
BDBM12775
NameBDBM12775
Synonyms:2-(5-carbamimidoyl-1H-indol-3-yl)-N-[4-(2-sulfamoylphenyl)phenyl]acetamide CHEMBL136846
TypeSmall organic molecule
Emp. Form.C23H21N5O3S
Mol. Mass.447.51
SMILESNC(=N)c1ccc2[nH]cc(CC(=O)Nc3ccc(cc3)-c3ccccc3S(N)(=O)=O)c2c1