Reaction Details
TargetCoagulation factor X
LigandBDBM50094100
Substrate/Competitorn/a
Meas. Tech.ChEMBL_48664 (CHEMBL657716)
Ki 0.6±n/a nM
Citation Han, QDominguez, CStouten, PFPark, JMDuffy, DEGalemmo, RARossi, KAAlexander, RSSmallwood, AMWong, PCWright, MMLuettgen, JMKnabb, RMWexler, RR Design, synthesis, and biological evaluation of potent and selective amidino bicyclic factor Xa inhibitors. J Med Chem43:4398-415 (2000) Coagulation factor X
Name:Coagulation factor X
Type:Enzyme
Mol. Mass.:54726.60
Organism:Homo sapiens (Human)
Description:n/a
Residue:488
BDBM50094100
NameBDBM50094100
Synonyms:2-(5-Carbamimidoyl-1H-indol-3-yl)-N-(3-iodo-2'-sulfamoyl-biphenyl-4-yl)-acetamide | CHEMBL341920
TypeSmall organic molecule
Emp. Form.C23H20IN5O3S
Mol. Mass.573.406
SMILESNC(=N)c1ccc2[nH]cc(CC(=O)Nc3ccc(cc3I)-c3ccccc3S(N)(=O)=O)c2c1