Reaction Details
TargetDelta-type opioid receptor
LigandBDBM50094634
Substrate/Competitorn/a
Meas. Tech.ChEMBL_145608 (CHEMBL749751)
Ki 8647±n/a nM
Citation Shinkai, HIto, TIida, TKitao, YYamada, HUchida, I 4-Aminoquinolines: novel nociceptin antagonists with analgesic activity. J Med Chem43:4667-77 (2001) Delta-type opioid receptor
Name:Delta-type opioid receptor
Type:G Protein-Coupled Receptor (GPCR)
Mol. Mass.:40382.98
Organism:Homo sapiens (Human)
Description:Competition binding assays were carried out using membrane preparations from transfected HN9.10 cells that constitutively expressed the delta opioid receptor.
Residue:372
BDBM50094634
NameBDBM50094634
Synonyms:CHEMBL140979 N-(4-amino-2-methylquinolin-6-yl)-2-((4-ethylphenoxy)methyl)benzamide
TypeSmall organic molecule
Emp. Form.C26H25N3O2
Mol. Mass.411.4956
SMILESCCc1ccc(OCc2ccccc2C(=O)Nc2ccc3nc(C)cc(N)c3c2)cc1