Reaction Details
TargetNociceptin receptor
LigandBDBM50094637
Substrate/Competitorn/a
Meas. Tech.ChEMBL_146120 (CHEMBL754589)
Ki 47±n/a nM
Citation Shinkai, HIto, TIida, TKitao, YYamada, HUchida, I 4-Aminoquinolines: novel nociceptin antagonists with analgesic activity. J Med Chem43:4667-77 (2001) Nociceptin receptor
Name:Nociceptin receptor
Type:G Protein-Coupled Receptor (GPCR)
Mol. Mass.:40702.87
Organism:Homo sapiens (Human)
Description:P41146
Residue:370
BDBM50094637
NameBDBM50094637
Synonyms:CHEMBL139566 | N-(4-Amino-2-methyl-quinolin-6-yl)-2-(4-hydroxy-phenoxymethyl)-benzamide
TypeSmall organic molecule
Emp. Form.C24H21N3O3
Mol. Mass.399.4418
SMILESCc1cc(N)c2cc(NC(=O)c3ccccc3COc3ccc(O)cc3)ccc2n1