Reaction Details
TargetNociceptin receptor
LigandBDBM50094654
Substrate/Competitorn/a
Meas. Tech.ChEMBL_146120 (CHEMBL754589)
Ki 369±n/a nM
Citation Shinkai, HIto, TIida, TKitao, YYamada, HUchida, I 4-Aminoquinolines: novel nociceptin antagonists with analgesic activity. J Med Chem43:4667-77 (2001) Nociceptin receptor
Name:Nociceptin receptor
Type:G Protein-Coupled Receptor (GPCR)
Mol. Mass.:40702.87
Organism:Homo sapiens (Human)
Description:P41146
Residue:370
BDBM50094654
NameBDBM50094654
Synonyms:Biphenyl-2-carboxylic acid (4-amino-2-methyl-quinolin-6-yl)-amide | CHEMBL139816
TypeSmall organic molecule
Emp. Form.C23H19N3O
Mol. Mass.353.4165
SMILESCc1cc(N)c2cc(NC(=O)c3ccccc3-c3ccccc3)ccc2n1