Reaction Details
TargetCathepsin K
LigandBDBM50096374
Substrate/Competitorn/a
Meas. Tech.ChEBML_48320
Ki 64±n/a nM
Citation Fenwick, AEGarnier, BGribble, ADIfe, RJRawlings, ADWitherington, J Solid-phase synthesis of cyclic alkoxyketones, inhibitors of the cysteine protease cathepsin K. Bioorg Med Chem Lett11:195-8 (2001) Cathepsin K
Name:Cathepsin K
Type:Enzyme
Mol. Mass.:36975.68
Organism:Homo sapiens (Human)
Description:P43235
Residue:329
BDBM50096374
NameBDBM50096374
Synonyms:4-Isopropyl-N-[(S)-3-methyl-1-(4-oxo-tetrahydro-furan-3-ylcarbamoyl)-butyl]-benzamide | CHEMBL60427
TypeSmall organic molecule
Emp. Form.C20H28N2O4
Mol. Mass.360.4473
SMILESCC(C)C[C@H](NC(=O)c1ccc(cc1)C(C)C)C(=O)NC1COCC1=O