Reaction Details
TargetCathepsin K
LigandBDBM50096380
Substrate/Competitorn/a
Meas. Tech.ChEBML_48320
Ki 38±n/a nM
Citation Fenwick, AEGarnier, BGribble, ADIfe, RJRawlings, ADWitherington, J Solid-phase synthesis of cyclic alkoxyketones, inhibitors of the cysteine protease cathepsin K. Bioorg Med Chem Lett11:195-8 (2001) Cathepsin K
Name:Cathepsin K
Type:Enzyme
Mol. Mass.:36975.68
Organism:Homo sapiens (Human)
Description:P43235
Residue:329
BDBM50096380
NameBDBM50096380
Synonyms:1H-Indole-6-carboxylic acid [(S)-3-methyl-1-(4-oxo-tetrahydro-furan-3-ylcarbamoyl)-butyl]-amide | CHEMBL61826
TypeSmall organic molecule
Emp. Form.C19H23N3O4
Mol. Mass.357.4036
SMILESCC(C)C[C@H](NC(=O)c1ccc2cc[nH]c2c1)C(=O)NC1COCC1=O