Reaction Details
TargetCathepsin K
LigandBDBM19804
Substrate/Competitorn/a
Meas. Tech.ChEBML_48320
Ki 44±n/a nM
Citation Fenwick, AEGarnier, BGribble, ADIfe, RJRawlings, ADWitherington, J Solid-phase synthesis of cyclic alkoxyketones, inhibitors of the cysteine protease cathepsin K. Bioorg Med Chem Lett11:195-8 (2001) Cathepsin K
Name:Cathepsin K
Type:Enzyme
Mol. Mass.:36975.68
Organism:Homo sapiens (Human)
Description:P43235
Residue:329
BDBM19804
NameBDBM19804
Synonyms:(2S)-4-methyl-N-(4-oxooxolan-3-yl)-2-(quinolin-2-ylformamido)pentanamide CHEMBL62239
TypeSmall organic molecule
Emp. Form.C20H23N3O4
Mol. Mass.369.4143
SMILESCC(C)C[C@H](NC(=O)c1ccc2ccccc2n1)C(=O)NC1COCC1=O