Reaction Details
TargetCannabinoid receptor 1
LigandBDBM50096881
Substrate/Competitorn/a
Meas. Tech.ChEBML_40026
Ki 1370±n/a nM
Citation Bezuglov, VBobrov, MGretskaya, NGonchar, AZinchenko, GMelck, DBisogno, TDi Marzo, VKuklev, DRossi, JCVidal, JPDurand, T Synthesis and biological evaluation of novel amides of polyunsaturated fatty acids with dopamine. Bioorg Med Chem Lett11:447-9 (2001) Cannabinoid receptor 1
Name:Cannabinoid receptor 1
Type:G Protein-Coupled Receptor (GPCR)
Mol. Mass.:52856.55
Organism:Rattus norvegicus (rat)
Description:P20272
Residue:473
BDBM50096881
NameBDBM50096881
Synonyms:(10Z,13Z,16Z,19Z)-Docosa-7,10,13,16,19-pentaenoic acid [2-(3,4-dihydroxy-phenyl)-ethyl]-amide | CHEMBL422633
TypeSmall organic molecule
Emp. Form.C30H43NO3
Mol. Mass.465.6673
SMILESCC\C=C/C\C=C/C\C=C/C\C=C/C\C=C/CCCCCC(=O)NCCc1ccc(O)c(O)c1