Reaction Details
TargetEukaryotic initiation factor 4A-I
LigandBDBM50080528
Substrate/Competitorn/a
Meas. Tech.ChEMBL_1983226 (CHEMBL4616488)
IC50 87±n/a nM
Citation Ernst, JTThompson, PANilewski, CSprengeler, PASperry, SPackard, GMichels, TXiang, ATran, CWegerski, CJEam, BYoung, NPFish, SChen, JHoward, HStaunton, JMolter, JClarine, JNevarez, AChiang, GGAppleman, JRWebster, KRReich, SH Design of Development Candidate eFT226, a First in Class Inhibitor of Eukaryotic Initiation Factor 4A RNA Helicase. J Med Chem63:5879-5955 (2020) 
 
Eukaryotic initiation factor 4A-I
Name:Eukaryotic initiation factor 4A-I
Type:PROTEIN
Mol. Mass.:46146.87
Organism:Homo sapiens (Human)
Description:ChEMBL_864983
Residue:406
BDBM50080528
NameBDBM50080528
Synonyms:3-((R)-2-((1S,3S,5S)-3,5-dimethyl-2-oxocyclohexyl)-2-hydroxyethyl)glutarimide CHEMBL123292 Zykloheximid cycloheximide | med.21724, Compound Cycloheximide
TypeSmall organic molecule
Emp. Form.C15H23NO4
Mol. Mass.281.3474
SMILESC[C@H]1C[C@H](C)C(=O)[C@@H](C1)[C@H](O)CC1CC(=O)NC(=O)C1