Reaction Details
TargetTrypsin
LigandBDBM50097619
Substrate/Competitorn/a
Meas. Tech.ChEMBL_212732 (CHEMBL819273)
Ki 27±n/a nM
Citation Fevig, JMPinto, DJHan, QQuan, MLPruitt, JRJacobson, ICGalemmo, RAWang, SOrwat, MJBostrom, LLKnabb, RMWong, PCLam PYS, naWexler, RR Synthesis and SAR of benzamidine factor Xa inhibitors containing a vicinally-substituted heterocyclic core. Bioorg Med Chem Lett11:641-5 (2001) Trypsin
Name:Trypsin
Synonyms:Serine protease 1/Trypsin-2/Trypsin-3
Type:n/a
Mol. Mass.:n/a
Description:ASSAY_ID of ChEMBL is 2155713
Components:This complex has 3 components.
Component 1
Name:Serine protease 1
Type:Enzyme
Mol. Mass.:26557.80
Organism:Homo sapiens (Human)
Description:P07477
Residue:247
Component 2
Name:Trypsin-2
Synonyms:Anionic trypsinogen Serine protease 2 TRY2_HUMAN Thrombin & trypsin Trypsin II | Trypsin-2
Type:PROTEIN
Mol. Mass.:26479.43
Organism:Homo sapiens (Human)
Description:ChEMBL_41517
Residue:247
Component 3
Name:Trypsin-3
Synonyms:Brain trypsinogen PRSS3 Serine protease 3 TRY3 TRY4 Trypsin Trypsin IV | Trypsin-3
Type:PROTEIN
Mol. Mass.:32532.52
Organism:Homo sapiens (Human)
Description:ChEMBL_216043
Residue:304
BDBM50097619
NameBDBM50097619
Synonyms:1-(3-Carbamimidoyl-phenyl)-4-methyl-1H-imidazole-2-carboxylic acid (2'-sulfamoyl-biphenyl-4-yl)-amide; TFA | CHEMBL346825
TypeSmall organic molecule
Emp. Form.C24H22N6O3S
Mol. Mass.474.535
SMILESCc1cn(c(n1)C(=O)Nc1ccc(cc1)-c1ccccc1S(N)(=O)=O)-c1cccc(c1)C(N)=N