Reaction Details
TargetAryl hydrocarbon receptor
LigandBDBM50541261
Substrate/Competitorn/a
Meas. Tech.ChEMBL_1984021 (CHEMBL4617427)
EC50 0.260000±n/a nM
Citation Wu, HLiu, BYang, KWinston-McPherson, GNLeisten, EDVezina, CMRicke, WAPeterson, RETang, W Synthesis and biological evaluation of FICZ analogues as agonists of aryl hydrocarbon receptor. Bioorg Med Chem Lett30:0 (2020) 
 
Aryl hydrocarbon receptor
Name:Aryl hydrocarbon receptor
Type:PROTEIN
Mol. Mass.:96143.77
Organism:Homo sapiens (Human)
Description:ChEMBL_1503828
Residue:848
BDBM50541261
NameBDBM50541261
Synonyms:CHEMBL4646273
TypeSmall organic molecule
Emp. Form.C20H14N2O
Mol. Mass.298.338
SMILESCn1c2ccccc2c2cc3[nH]c4ccccc4c3c(C=O)c12