Reaction Details
TargetAryl hydrocarbon receptor
LigandBDBM50541262
Substrate/Competitorn/a
Meas. Tech.ChEMBL_1984021 (CHEMBL4617427)
EC50 2.0±n/a nM
Citation Wu, HLiu, BYang, KWinston-McPherson, GNLeisten, EDVezina, CMRicke, WAPeterson, RETang, W Synthesis and biological evaluation of FICZ analogues as agonists of aryl hydrocarbon receptor. Bioorg Med Chem Lett30:0 (2020) 
 
Aryl hydrocarbon receptor
Name:Aryl hydrocarbon receptor
Type:PROTEIN
Mol. Mass.:96143.77
Organism:Homo sapiens (Human)
Description:ChEMBL_1503828
Residue:848
BDBM50541262
NameBDBM50541262
Synonyms:6-Formylindolo[3,2-B]Carbazole | CHEMBL472031
TypeSmall organic molecule
Emp. Form.C19H12N2O
Mol. Mass.284.3114
SMILESO=Cc1c2[nH]c3ccccc3c2cc2[nH]c3ccccc3c12