Reaction Details
TargetHistamine H3 receptor
LigandBDBM50092833
Substrate/Competitorn/a
Meas. Tech.ChEBML_83643
Ki 27±n/a nM
Citation Stark, HSippl, WLigneau, XArrang, JMGanellin, CRSchwartz, JCSchunack, W Different antagonist binding properties of human and rat histamine H3 receptors. Bioorg Med Chem Lett11:951-4 (2001) Histamine H3 receptor
Name:Histamine H3 receptor
Type:G Protein-Coupled Receptor (GPCR)
Mol. Mass.:48691.47
Organism:Homo sapiens (Human)
Description:Binding assays were using CHO cells stably expressing hH3R receptors.
Residue:445
BDBM50092833
NameBDBM50092833
Synonyms:4-(3-Phenoxy-propyl)-1H-imidazole with (0.95M)oxalic acid CHEMBL128923
TypeSmall organic molecule
Emp. Form.C12H14N2O
Mol. Mass.202.2524
SMILESC(COc1ccccc1)Cc1cnc[nH]1