Reaction Details
TargetHistamine H3 receptor
LigandBDBM50053292
Substrate/Competitorn/a
Meas. Tech.ChEBML_86751
Ki 3.6±n/a nM
Citation Stark, HSippl, WLigneau, XArrang, JMGanellin, CRSchwartz, JCSchunack, W Different antagonist binding properties of human and rat histamine H3 receptors. Bioorg Med Chem Lett11:951-4 (2001) Histamine H3 receptor
Name:Histamine H3 receptor
Type:G Protein-Coupled Receptor (GPCR)
Mol. Mass.:48607.98
Organism:Rattus norvegicus (rat)
Description:n/a
Residue:445
BDBM50053292
NameBDBM50053292
Synonyms:1-{4-[2-(1H-Imidazol-4-yl)-ethoxy]-phenyl}-ethanone | CHEMBL124270
TypeSmall organic molecule
Emp. Form.C13H14N2O2
Mol. Mass.230.2625
SMILESCC(=O)c1ccc(OCCc2cnc[nH]2)cc1