Reaction Details
TargetHistamine H3 receptor
LigandBDBM22915
Substrate/Competitorn/a
Meas. Tech.ChEBML_83643
Ki 2.7±n/a nM
Citation Stark, HSippl, WLigneau, XArrang, JMGanellin, CRSchwartz, JCSchunack, W Different antagonist binding properties of human and rat histamine H3 receptors. Bioorg Med Chem Lett11:951-4 (2001) Histamine H3 receptor
Name:Histamine H3 receptor
Type:G Protein-Coupled Receptor (GPCR)
Mol. Mass.:48691.47
Organism:Homo sapiens (Human)
Description:Binding assays were using CHO cells stably expressing hH3R receptors.
Residue:445
BDBM22915
NameBDBM22915
Synonyms:3-(1H-imidazol-4-yl)propylphenylmethyl ether CHEMBL61618 | Proxyfan
TypeSmall organic molecule
Emp. Form.C13H16N2O
Mol. Mass.216.2789
SMILESC(COCc1ccccc1)Cc1cnc[nH]1