Reaction Details
TargetIntegrin alpha-IIb/beta-3
LigandBDBM50098966
Substrate/Competitorn/a
Meas. Tech.ChEMBL_216428 (CHEMBL821358)
IC50 0.550000±n/a nM
Citation Manaka, ASato, MAoki, MTanaka, MIkeda, TToda, YYamane, YNakaike, S 2-Acylimino-3H-thiazoline derivatives: a novel template for platelet GPIIb/IIIa receptor antagonists. Bioorg Med Chem Lett11:1031-5 (2001) Integrin alpha-IIb/beta-3
Name:Integrin alpha-IIb/beta-3
Synonyms:Glycoprotein IIb/IIIa
Type:n/a
Mol. Mass.:n/a
Description:ASSAY_ID of EBI is 30109
Components:This complex has 2 components.
Component 1
Name:Integrin beta-3
Type:Protein
Mol. Mass.:87038.91
Organism:Homo sapiens (Human)
Description:P05106
Residue:788
Component 2
Name:Integrin alpha-IIb
Synonyms:CD_antigen=CD41 GPIIb Glycoprotein IIb ITGA2B Integrin alpha-IIb heavy chain Integrin alpha-IIb light chain, form 2 Integrin alpha-V/beta-3 and alpha-IIb/beta 3 | Platelet membrane glycoprotein IIb
Type:Protein
Mol. Mass.:113354.85
Organism:Homo sapiens (Human)
Description:P08514
Residue:1039
BDBM50098966
NameBDBM50098966
Synonyms:3-[3-(4-Carbamimidoyl-benzoylamino)-phenyl]-propionic acid | CHEMBL8283
TypeSmall organic molecule
Emp. Form.C17H17N3O3
Mol. Mass.311.3352
SMILESNC(=N)c1ccc(cc1)C(=O)Nc1cccc(CCC(O)=O)c1