Reaction Details
TargetEstrogen receptor
LigandBDBM50099585
Substrate/Competitorn/a
Meas. Tech.ChEMBL_99805 (CHEMBL710408)
IC50 3.7±n/a nM
Citation Miller, CPCollini, MDTran, BDHarris, HAKharode, YPMarzolf, JTMoran, RAHenderson, RABender, RHUnwalla, RJGreenberger, LMYardley, JPAbou-Gharbia, MALyttle, CRKomm, BS Design, synthesis, and preclinical characterization of novel, highly selective indole estrogens. J Med Chem44:1654-7 (2001) Estrogen receptor
Name:Estrogen receptor
Type:Protein
Mol. Mass.:66230.44
Organism:Homo sapiens (Human)
Description:P03372
Residue:595
BDBM50099585
NameBDBM50099585
Synonyms:1-(4-(2-(azepan-1-yl)ethoxy)benzyl)-2-(4-hydroxyphenyl)-3-methyl-1H-indol-5-ol BAZEDOXIFENE US8815934, No. 98
TypeSmall organic molecule
Emp. Form.C30H34N2O3
Mol. Mass.470.6026
SMILESCc1c(-c2ccc(O)cc2)n(Cc2ccc(OCCN3CCCCCC3)cc2)c2ccc(O)cc12