Reaction Details
TargetEstrogen receptor
LigandBDBM20625
Substrate/Competitorn/a
Meas. Tech.ChEMBL_67173 (CHEMBL681157)
IC50 3±n/a nM
Citation Miller, CPCollini, MDTran, BDHarris, HAKharode, YPMarzolf, JTMoran, RAHenderson, RABender, RHUnwalla, RJGreenberger, LMYardley, JPAbou-Gharbia, MALyttle, CRKomm, BS Design, synthesis, and preclinical characterization of novel, highly selective indole estrogens. J Med Chem44:1654-7 (2001) Estrogen receptor
Name:Estrogen receptor
Type:Protein
Mol. Mass.:66230.44
Organism:Homo sapiens (Human)
Description:P03372
Residue:595
BDBM20625
NameBDBM20625
Synonyms:4-[(3E)-4-(4-hydroxyphenyl)hex-3-en-3-yl]phenol CHEMBL411 Diethylstilbestrol (1) Stilboestroform
TypeSmall organic molecule
Emp. Form.C18H20O2
Mol. Mass.268.3502
SMILESCC\C(=C(\CC)c1ccc(O)cc1)c1ccc(O)cc1