Reaction Details
TargetEstrogen receptor beta
LigandBDBM50099587
Substrate/Competitorn/a
Meas. Tech.ChEMBL_67341 (CHEMBL677746)
IC50 40±n/a nM
Citation Miller, CPCollini, MDTran, BDHarris, HAKharode, YPMarzolf, JTMoran, RAHenderson, RABender, RHUnwalla, RJGreenberger, LMYardley, JPAbou-Gharbia, MALyttle, CRKomm, BS Design, synthesis, and preclinical characterization of novel, highly selective indole estrogens. J Med Chem44:1654-7 (2001) Estrogen receptor beta
Name:Estrogen receptor beta
Type:Protein
Mol. Mass.:59238.43
Organism:Homo sapiens (Human)
Description:Q92731
Residue:530
BDBM50099587
NameBDBM50099587
Synonyms:2-(4-Hydroxy-phenyl)-3-methyl-1-[4-(2-piperidin-1-yl-ethoxy)-benzyl]-1H-indol-5-ol Pipendoxifene US8815934, No. 97
TypeSmall organic molecule
Emp. Form.C29H32N2O3
Mol. Mass.456.576
SMILESCc1c(-c2ccc(O)cc2)n(Cc2ccc(OCCN3CCCCC3)cc2)c2ccc(O)cc12