Reaction Details
TargetVoltage-dependent T-type calcium channel subunit alpha-1G
LigandBDBM50117922
Substrate/Competitorn/a
Meas. Tech.ChEMBL_1989579 (CHEMBL4623314)
IC50 1340±n/a nM
Citation Nam, YRyu, KDJang, CMoon, YHKim, MKo, DChung, KSGandini, MALee, KTZamponi, GWLee, JY Synthesis and cytotoxic effects of 2-thio-3,4-dihydroquinazoline derivatives as novel T-type calcium channel blockers. Bioorg Med Chem28:0 (2020) 
 
Voltage-dependent T-type calcium channel subunit alpha-1G
Name:Voltage-dependent T-type calcium channel subunit alpha-1G
Type:PROTEIN
Mol. Mass.:262471.14
Organism:Homo sapiens (Human)
Description:ChEMBL_1515216
Residue:2377
BDBM50117922
NameBDBM50117922
Synonyms:(1S,2S)-2-(2-((3-(1H-benzo[d]imidazol-2-yl)propyl)(methyl)amino)ethyl)-6-fluoro-1-isopropyl-1,2,3,4-tetrahydronaphthalen-2-yl 2-methoxyacetate CHEMBL45816 Methoxy-acetic acid (1S,2S)-2-(2-{[3-(1H-benzoimidazol-2-yl)-propyl]-methyl-amino}-ethyl)-6-fluoro-1-isopropyl-1,2,3,4-tetrahydro-naphthalen-2-yl ester Mibefradil dihydrochloride
TypeSmall organic molecule
Emp. Form.C29H38FN3O3
Mol. Mass.495.6287
SMILESCOCC(=O)O[C@]1(CCN(C)CCCc2nc3ccccc3[nH]2)CCc2cc(F)ccc2[C@@H]1C(C)C