Reaction Details
TargetPeroxisome proliferator-activated receptor gamma
LigandBDBM50064451
Substrate/Competitorn/a
Meas. Tech.ChEMBL_220904 (CHEMBL824659)
IC50 14±n/a nM
Citation Brooks, DAEtgen, GJRito, CJShuker, AJDominianni, SJWarshawsky, AMArdecky, RPaterniti, JRTyhonas, JKaranewsky, DSKauffman, RFBroderick, CLOldham, BAMontrose-Rafizadeh, CWinneroski, LLFaul, MMMcCarthy, JR Design and synthesis of 2-methyl-2-[4-(2-[5-methyl-2-aryloxazol-4-yl]ethoxy)phenoxy]propionic acids: a new class of dual PPARalpha/gamma agonists. J Med Chem44:2061-4 (2001) Peroxisome proliferator-activated receptor gamma
Name:Peroxisome proliferator-activated receptor gamma
Type:Nuclear Receptor
Mol. Mass.:57613.46
Organism:Homo sapiens (Human)
Description:P37231
Residue:505
BDBM50064451
NameBDBM50064451
Synonyms:5-{4-[2-(5-Methyl-2-phenyl-oxazol-4-yl)-ethoxy]-benzyl}-thiazolidine-2,4-dione | CHEMBL59132
TypeSmall organic molecule
Emp. Form.C22H20N2O4S
Mol. Mass.408.47
SMILESCc1oc(nc1CCOc1ccc(Cc2sc(=O)[nH]c2O)cc1)-c1ccccc1