Reaction Details
TargetPeroxisome proliferator-activated receptor gamma
LigandBDBM50075315
Substrate/Competitorn/a
Meas. Tech.ChEMBL_220901 (CHEMBL824656)
EC50 1090±n/a nM
Citation Brooks, DAEtgen, GJRito, CJShuker, AJDominianni, SJWarshawsky, AMArdecky, RPaterniti, JRTyhonas, JKaranewsky, DSKauffman, RFBroderick, CLOldham, BAMontrose-Rafizadeh, CWinneroski, LLFaul, MMMcCarthy, JR Design and synthesis of 2-methyl-2-[4-(2-[5-methyl-2-aryloxazol-4-yl]ethoxy)phenoxy]propionic acids: a new class of dual PPARalpha/gamma agonists. J Med Chem44:2061-4 (2001) Peroxisome proliferator-activated receptor gamma
Name:Peroxisome proliferator-activated receptor gamma
Type:Nuclear Receptor
Mol. Mass.:57613.46
Organism:Homo sapiens (Human)
Description:P37231
Residue:505
BDBM50075315
NameBDBM50075315
Synonyms:5-(2,4-Dioxo-thiazolidin-5-ylmethyl)-2-methoxy-N-(4-trifluoromethyl-benzyl)-benzamide CHEMBL24458 | KRP-297
TypeSmall organic molecule
Emp. Form.C20H17F3N2O4S
Mol. Mass.438.42
SMILESCOc1ccc(Cc2sc(=O)[nH]c2O)cc1C(=O)NCc1ccc(cc1)C(F)(F)F