Reaction Details
TargetPeroxisome proliferator-activated receptor alpha
LigandBDBM50100442
Substrate/Competitorn/a
Meas. Tech.ChEMBL_220899 (CHEMBL824654)
IC50 174±n/a nM
Citation Brooks, DAEtgen, GJRito, CJShuker, AJDominianni, SJWarshawsky, AMArdecky, RPaterniti, JRTyhonas, JKaranewsky, DSKauffman, RFBroderick, CLOldham, BAMontrose-Rafizadeh, CWinneroski, LLFaul, MMMcCarthy, JR Design and synthesis of 2-methyl-2-[4-(2-[5-methyl-2-aryloxazol-4-yl]ethoxy)phenoxy]propionic acids: a new class of dual PPARalpha/gamma agonists. J Med Chem44:2061-4 (2001) Peroxisome proliferator-activated receptor alpha
Name:Peroxisome proliferator-activated receptor alpha
Type:Enzyme
Mol. Mass.:52222.08
Organism:Homo sapiens (Human)
Description:Q07869
Residue:468
BDBM50100442
NameBDBM50100442
Synonyms:2-{4-[2-(2-Biphenyl-4-yl-5-methyl-oxazol-4-yl)-ethoxy]-phenoxy}-2-methyl-propionic acid | CHEMBL25259
TypeSmall organic molecule
Emp. Form.C28H27NO5
Mol. Mass.457.5177
SMILESCc1oc(nc1CCOc1ccc(OC(C)(C)C(O)=O)cc1)-c1ccc(cc1)-c1ccccc1