Reaction Details
TargetProstaglandin G/H synthase 2
LigandBDBM50100939
Substrate/Competitorn/a
Meas. Tech.ChEBML_159582
IC50 4700±n/a nM
Citation Lee, DPark, EJCuendet, MAxelrod, FChavez, PIFong, HHPezzuto, JMKinghorn, AD Cyclooxygenase-inhibitory and antioxidant constituents of the aerial parts of Antirhea acutata. Bioorg Med Chem Lett11:1565-8 (2001) Prostaglandin G/H synthase 2
Name:Prostaglandin G/H synthase 2
Type:Enzyme
Mol. Mass.:69003.89
Organism:Homo sapiens (Human)
Description:Recombinant Cox-2 provided by Cayman (Cayman Chemical Co.,Ann Arbor, MI).
Residue:604
BDBM50100939
NameBDBM50100939
Synonyms:3-[(2S,3S,3aR,4aS,6aR,7R,9aS,9bS)-7-((R)-1,5-Dimethyl-hex-4-enyl)-2-hydroxy-6a,9a-dimethyl-3-vinyl-decahydro-cyclopenta[a]cyclopropa[e]naphthalen-3a-yl]-propionic acid | CHEMBL39521
TypeSmall organic molecule
Emp. Form.C29H46O3
Mol. Mass.442.6737
SMILES[#6]-[#6@H](-[#6]-[#6]\[#6]=[#6](\[#6])-[#6])-[#6@H]1-[#6]-[#6][C@@]2([#6])[#6@@H]3-[#6]-[#6@H](-[#8])-[#6@@H](-[#6]=[#6])[C@@]4([#6]-[#6]-[#6](-[#8])=O)[#6][C@@]34[#6]-[#6][C@]12[#6]