Reaction Details
TargetThymidine kinase
LigandBDBM50101049
Substrate/Competitorn/a
Meas. Tech.ChEBML_210611
IC50 1.5±n/a nM
Citation Martin, JALambert, RWMerrett, JHParkes, KEThomas, GJBaker, SJBushnell, DJCansfield, JEDunsdon, SJFreeman, ACHopkins, RAJohns, IRKeech, ESimmonite, HWalmsley, AWong Kai-In, PHolland, M Nucleoside analogues as highly potent and selective inhibitors of herpes simplex virus thymidine kinase. Bioorg Med Chem Lett11:1655-8 (2001) Thymidine kinase
Name:Thymidine kinase
Type:PROTEIN
Mol. Mass.:40883.42
Organism:Human herpesvirus 1 (strain SC16) (HHV-1) (Human herpes simplex virus1)
Description:ChEMBL_213
Residue:376
BDBM50101049
NameBDBM50101049
Synonyms:10,10-Dimethyl-9,10-dihydro-anthracene-9-carboxylic acid [(2R,3R,4S,5R)-5-(5-ethyl-2,4-dioxo-3,4-dihydro-2H-pyrimidin-1-yl)-4-fluoro-3-hydroxy-tetrahydro-furan-2-ylmethyl]-amide | CHEMBL46633
TypeSmall organic molecule
Emp. Form.C28H30FN3O5
Mol. Mass.507.5533
SMILESCCc1cn([C@@H]2O[C@H](CNC(=O)C3c4ccccc4C(C)(C)c4ccccc34)[C@@H](O)[C@@H]2F)c(=O)[nH]c1=O