Reaction Details
TargetTyrosine-protein phosphatase non-receptor type 1
LigandBDBM50103238
Substrate/Competitorn/a
Meas. Tech.ChEMBL_162609 (CHEMBL771321)
Ki 250000±n/a nM
Citation Gao, YVoigt, JZhao, HPais, GCZhang, XWu, LZhang, ZYBurke, TR Utilization of a peptide lead for the discovery of a novel PTP1B-binding motif. J Med Chem44:2869-78 (2001) Tyrosine-protein phosphatase non-receptor type 1
Name:Tyrosine-protein phosphatase non-receptor type 1
Type:Protein phosphatase
Mol. Mass.:49963.76
Organism:Homo sapiens (Human)
Description:Human recombinant GST-fusion PTP1B (1-435).
Residue:435
BDBM50103238
NameBDBM50103238
Synonyms:3-Carboxymethoxy-naphthalene-2,7-dicarboxylic acid | CHEMBL95468
TypeSmall organic molecule
Emp. Form.C14H10O7
Mol. Mass.290.225
SMILESOC(=O)COc1cc2ccc(cc2cc1C(O)=O)C(O)=O