Reaction Details
TargetAndrogen receptor
LigandBDBM50062433
Substrate/Competitorn/a
Meas. Tech.ChEMBL_36280 (CHEMBL651954)
Ki 1400±n/a nM
Citation Coghlan, MJKym, PRElmore, SWWang, AXLuly, JRWilcox, DStashko, MLin, CWMiner, JTyree, CNakane, MJacobson, PLane, BC Synthesis and characterization of non-steroidal ligands for the glucocorticoid receptor: selective quinoline derivatives with prednisolone-equivalent functional activity. J Med Chem44:2879-85 (2001) Androgen receptor
Name:Androgen receptor
Type:Receptor
Mol. Mass.:99185.27
Organism:Homo sapiens (Human)
Description:CHO cells were stably transfected with human AR gene.
Residue:920
BDBM50062433
NameBDBM50062433
Synonyms:9-Chloro-2,2,4-trimethyl-5-phenyl-2,5-dihydro-1H-6-oxa-1-aza-chrysene | CHEMBL318409
TypeSmall organic molecule
Emp. Form.C25H22ClNO
Mol. Mass.387.901
SMILESCC1=CC(C)(C)Nc2ccc3-c4cc(Cl)ccc4OC(c4ccccc4)c3c12