Reaction Details
TargetProgesterone receptor
LigandBDBM50103251
Substrate/Competitorn/a
Meas. Tech.ChEMBL_223461 (CHEMBL844873)
Ki 1560±n/a nM
Citation Coghlan, MJKym, PRElmore, SWWang, AXLuly, JRWilcox, DStashko, MLin, CWMiner, JTyree, CNakane, MJacobson, PLane, BC Synthesis and characterization of non-steroidal ligands for the glucocorticoid receptor: selective quinoline derivatives with prednisolone-equivalent functional activity. J Med Chem44:2879-85 (2001) Progesterone receptor
Name:Progesterone receptor
Type:Protein
Mol. Mass.:98979.52
Organism:Homo sapiens (Human)
Description:P06401
Residue:933
BDBM50103251
NameBDBM50103251
Synonyms:5-(3,5-Dichloro-phenyl)-10-methoxy-2,2,4-trimethyl-2,5-dihydro-1H-6-oxa-1-aza-chrysene | CHEMBL419158
TypeSmall organic molecule
Emp. Form.C26H23Cl2NO2
Mol. Mass.452.372
SMILESCOc1cccc2OC(c3cc(Cl)cc(Cl)c3)c3c(ccc4NC(C)(C)C=C(C)c34)-c12