Reaction Details
TargetGlucocorticoid receptor
LigandBDBM50103247
Substrate/Competitorn/a
Meas. Tech.ChEMBL_50717 (CHEMBL666796)
IC50 105±n/a nM
Citation Coghlan, MJKym, PRElmore, SWWang, AXLuly, JRWilcox, DStashko, MLin, CWMiner, JTyree, CNakane, MJacobson, PLane, BC Synthesis and characterization of non-steroidal ligands for the glucocorticoid receptor: selective quinoline derivatives with prednisolone-equivalent functional activity. J Med Chem44:2879-85 (2001) Glucocorticoid receptor
Name:Glucocorticoid receptor
Type:Enzyme
Mol. Mass.:85656.87
Organism:Homo sapiens (Human)
Description:P04150
Residue:777
BDBM50103247
NameBDBM50103247
Synonyms:10-Methoxy-2,2,4-trimethyl-5-(3-trifluoromethyl-phenyl)-2,5-dihydro-1H-6-oxa-1-aza-chrysene | CHEMBL95644
TypeSmall organic molecule
Emp. Form.C27H24F3NO2
Mol. Mass.451.4802
SMILESCOc1cccc2OC(c3cccc(c3)C(F)(F)F)c3c(ccc4NC(C)(C)C=C(C)c34)-c12