Reaction Details
TargetGlucocorticoid receptor
LigandBDBM50103245
Substrate/Competitorn/a
Meas. Tech.ChEMBL_71404 (CHEMBL680190)
Ki 18±n/a nM
Citation Coghlan, MJKym, PRElmore, SWWang, AXLuly, JRWilcox, DStashko, MLin, CWMiner, JTyree, CNakane, MJacobson, PLane, BC Synthesis and characterization of non-steroidal ligands for the glucocorticoid receptor: selective quinoline derivatives with prednisolone-equivalent functional activity. J Med Chem44:2879-85 (2001) Glucocorticoid receptor
Name:Glucocorticoid receptor
Type:Enzyme
Mol. Mass.:85656.87
Organism:Homo sapiens (Human)
Description:P04150
Residue:777
BDBM50103245
NameBDBM50103245
Synonyms:9-Methoxy-2,2,4-trimethyl-5-phenyl-2,5-dihydro-1H-6-oxa-1-aza-chrysene | CHEMBL317983
TypeSmall organic molecule
Emp. Form.C26H25NO2
Mol. Mass.383.4822
SMILESCOc1ccc2OC(c3ccccc3)c3c(ccc4NC(C)(C)C=C(C)c34)-c2c1