Reaction Details
TargetProgesterone receptor
LigandBDBM50103246
Substrate/Competitorn/a
Meas. Tech.ChEMBL_223461 (CHEMBL844873)
Ki>5000±n/a nM
Citation Coghlan, MJKym, PRElmore, SWWang, AXLuly, JRWilcox, DStashko, MLin, CWMiner, JTyree, CNakane, MJacobson, PLane, BC Synthesis and characterization of non-steroidal ligands for the glucocorticoid receptor: selective quinoline derivatives with prednisolone-equivalent functional activity. J Med Chem44:2879-85 (2001) Progesterone receptor
Name:Progesterone receptor
Type:Protein
Mol. Mass.:98979.52
Organism:Homo sapiens (Human)
Description:P06401
Residue:933
BDBM50103246
NameBDBM50103246
Synonyms:10-Methoxy-2,2,4-trimethyl-5-phenyl-2,5-dihydro-1H-6-oxa-1-aza-chrysene | CHEMBL99046
TypeSmall organic molecule
Emp. Form.C26H25NO2
Mol. Mass.383.4822
SMILESCOc1cccc2OC(c3ccccc3)c3c(ccc4NC(C)(C)C=C(C)c34)-c12