Reaction Details
TargetGeranylgeranyl transferase type-1 subunit beta
LigandBDBM16179
Substrate/Competitorn/a
Meas. Tech.ChEMBL_72108 (CHEMBL683552)
IC50 3400±n/a nM
Citation Bell, IMGallicchio, SNAbrams, MBeshore, DCBuser, CACulberson, JCDavide, JEllis-Hutchings, MFernandes, CGibbs, JBGraham, SLHartman, GDHeimbrook, DCHomnick, CFHuff, JRKassahun, KKoblan, KSKohl, NELobell, RBLynch, JJMiller, PAOmer, CARodrigues, ADWalsh, ESWilliams, TM Design and biological activity of (S)-4-(5-([1-(3-chlorobenzyl)-2-oxopyrrolidin-3-ylamino]methyl)imidazol-1-ylmethyl)benzonitrile, a 3-aminopyrrolidinone farnesyltransferase inhibitor with excellent cell potency. J Med Chem44:2933-49 (2001) Geranylgeranyl transferase type-1 subunit beta
Name:Geranylgeranyl transferase type-1 subunit beta
Type:n/a
Mol. Mass.:42369.84
Organism:Homo sapiens (Human)
Description:n/a
Residue:377
BDBM16179
NameBDBM16179
Synonyms:4-{[5-({[(3S)-1-(3-chlorobenzyl)-2-oxopyrrolidin-3-yl]amino}methyl)-1H-imidazol-1-yl]methyl}benzonitrile CHEMBL312137 | MSD-1
TypeSmall organic molecule
Emp. Form.C23H22ClN5O
Mol. Mass.419.907
SMILESClc1cccc(CN2CC[C@H](NCc3cncn3Cc3ccc(cc3)C#N)C2=O)c1