Reaction Details
TargetDimer of Protein farnesyltransferase subunit beta
LigandBDBM16179
Substrate/Competitorn/a
Meas. Tech.ChEMBL_69996 (CHEMBL681469)
IC50 0.52±n/a nM
Citation Bell, IMGallicchio, SNAbrams, MBeshore, DCBuser, CACulberson, JCDavide, JEllis-Hutchings, MFernandes, CGibbs, JBGraham, SLHartman, GDHeimbrook, DCHomnick, CFHuff, JRKassahun, KKoblan, KSKohl, NELobell, RBLynch, JJMiller, PAOmer, CARodrigues, ADWalsh, ESWilliams, TM Design and biological activity of (S)-4-(5-([1-(3-chlorobenzyl)-2-oxopyrrolidin-3-ylamino]methyl)imidazol-1-ylmethyl)benzonitrile, a 3-aminopyrrolidinone farnesyltransferase inhibitor with excellent cell potency. J Med Chem44:2933-49 (2001) Dimer of Protein farnesyltransferase subunit beta
Name:Dimer of Protein farnesyltransferase subunit beta
Synonyms:Protein Farnesyltransferase (PFT) Chain B
Type:n/a
Mol. Mass.:n/a
Description:ASSAY_ID of EBI is 51428
Components:This complex has 3 components.
Component 1
Name:Protein farnesyltransferase subunit beta
Type:Enzyme Subunit
Mol. Mass.:48766.02
Organism:Homo sapiens (Human)
Description:Protein farnesyltransferase subunit beta
Residue:437
Component 2
Name:Protein farnesyltransferase subunit beta
Synonyms:CAAX farnesyltransferase subunit alpha FNTB FTase-alpha GGTase-I-alpha Protein farnesyl/geranylgeranyl transferase Protein farnesyltransferase subunit beta Protein farnesyltransferase/geranylgeranyltransferase type-1 subunit alpha Ras proteins prenyltransferase subunit beta | Type I protein geranyl-geranyltransferase subunit alpha
Type:Enzyme Subunit
Mol. Mass.:48766.02
Organism:Homo sapiens (Human)
Description:Protein farnesyltransferase subunit beta
Residue:437
BDBM16179
NameBDBM16179
Synonyms:4-{[5-({[(3S)-1-(3-chlorobenzyl)-2-oxopyrrolidin-3-yl]amino}methyl)-1H-imidazol-1-yl]methyl}benzonitrile CHEMBL312137 | MSD-1
TypeSmall organic molecule
Emp. Form.C23H22ClN5O
Mol. Mass.419.907
SMILESClc1cccc(CN2CC[C@H](NCc3cncn3Cc3ccc(cc3)C#N)C2=O)c1