Reaction Details
TargetGeranylgeranyl transferase type-1 subunit beta
LigandBDBM50103340
Substrate/Competitorn/a
Meas. Tech.ChEMBL_72108 (CHEMBL683552)
IC50 2800±n/a nM
Citation Bell, IMGallicchio, SNAbrams, MBeshore, DCBuser, CACulberson, JCDavide, JEllis-Hutchings, MFernandes, CGibbs, JBGraham, SLHartman, GDHeimbrook, DCHomnick, CFHuff, JRKassahun, KKoblan, KSKohl, NELobell, RBLynch, JJMiller, PAOmer, CARodrigues, ADWalsh, ESWilliams, TM Design and biological activity of (S)-4-(5-([1-(3-chlorobenzyl)-2-oxopyrrolidin-3-ylamino]methyl)imidazol-1-ylmethyl)benzonitrile, a 3-aminopyrrolidinone farnesyltransferase inhibitor with excellent cell potency. J Med Chem44:2933-49 (2001) Geranylgeranyl transferase type-1 subunit beta
Name:Geranylgeranyl transferase type-1 subunit beta
Type:n/a
Mol. Mass.:42369.84
Organism:Homo sapiens (Human)
Description:n/a
Residue:377
BDBM50103340
NameBDBM50103340
Synonyms:4-{5-[2-(2-Oxo-1-phenethyl-pyrrolidin-3-ylamino)-ethyl]-imidazol-1-ylmethyl}-benzonitrile | CHEMBL102107
TypeSmall organic molecule
Emp. Form.C25H27N5O
Mol. Mass.413.5148
SMILESO=C1[C@H](CCN1CCc1ccccc1)NCCc1cncn1Cc1ccc(cc1)C#N