Reaction Details
TargetGeranylgeranyl transferase type-1 subunit beta
LigandBDBM50103360
Substrate/Competitorn/a
Meas. Tech.ChEMBL_72108 (CHEMBL683552)
IC50 2700±n/a nM
Citation Bell, IMGallicchio, SNAbrams, MBeshore, DCBuser, CACulberson, JCDavide, JEllis-Hutchings, MFernandes, CGibbs, JBGraham, SLHartman, GDHeimbrook, DCHomnick, CFHuff, JRKassahun, KKoblan, KSKohl, NELobell, RBLynch, JJMiller, PAOmer, CARodrigues, ADWalsh, ESWilliams, TM Design and biological activity of (S)-4-(5-([1-(3-chlorobenzyl)-2-oxopyrrolidin-3-ylamino]methyl)imidazol-1-ylmethyl)benzonitrile, a 3-aminopyrrolidinone farnesyltransferase inhibitor with excellent cell potency. J Med Chem44:2933-49 (2001) Geranylgeranyl transferase type-1 subunit beta
Name:Geranylgeranyl transferase type-1 subunit beta
Type:n/a
Mol. Mass.:42369.84
Organism:Homo sapiens (Human)
Description:n/a
Residue:377
BDBM50103360
NameBDBM50103360
Synonyms:(3-{[1-(3-Chloro-benzyl)-2-oxo-pyrrolidin-3-yl]-[3-(4-cyano-benzyl)-3H-imidazol-4-ylmethyl]-amino}-propyl)-carbamic acid tert-butyl ester | CHEMBL100661
TypeSmall organic molecule
Emp. Form.C31H37ClN6O3
Mol. Mass.577.117
SMILESCC(C)(C)OC(=O)NCCCN(Cc1cncn1Cc1ccc(cc1)C#N)[C@H]1CCN(Cc2cccc(Cl)c2)C1=O