Reaction Details
TargetDimer of Protein farnesyltransferase subunit beta
LigandBDBM50103360
Substrate/Competitorn/a
Meas. Tech.ChEMBL_69997 (CHEMBL681470)
IC50 1.3±n/a nM
Citation Bell, IMGallicchio, SNAbrams, MBeshore, DCBuser, CACulberson, JCDavide, JEllis-Hutchings, MFernandes, CGibbs, JBGraham, SLHartman, GDHeimbrook, DCHomnick, CFHuff, JRKassahun, KKoblan, KSKohl, NELobell, RBLynch, JJMiller, PAOmer, CARodrigues, ADWalsh, ESWilliams, TM Design and biological activity of (S)-4-(5-([1-(3-chlorobenzyl)-2-oxopyrrolidin-3-ylamino]methyl)imidazol-1-ylmethyl)benzonitrile, a 3-aminopyrrolidinone farnesyltransferase inhibitor with excellent cell potency. J Med Chem44:2933-49 (2001) Dimer of Protein farnesyltransferase subunit beta
Name:Dimer of Protein farnesyltransferase subunit beta
Synonyms:Protein Farnesyltransferase (PFT) Chain B
Type:n/a
Mol. Mass.:n/a
Description:ASSAY_ID of EBI is 51428
Components:This complex has 3 components.
Component 1
Name:Protein farnesyltransferase subunit beta
Type:Enzyme Subunit
Mol. Mass.:48766.02
Organism:Homo sapiens (Human)
Description:Protein farnesyltransferase subunit beta
Residue:437
Component 2
Name:Protein farnesyltransferase subunit beta
Synonyms:CAAX farnesyltransferase subunit alpha FNTB FTase-alpha GGTase-I-alpha Protein farnesyl/geranylgeranyl transferase Protein farnesyltransferase subunit beta Protein farnesyltransferase/geranylgeranyltransferase type-1 subunit alpha Ras proteins prenyltransferase subunit beta | Type I protein geranyl-geranyltransferase subunit alpha
Type:Enzyme Subunit
Mol. Mass.:48766.02
Organism:Homo sapiens (Human)
Description:Protein farnesyltransferase subunit beta
Residue:437
BDBM50103360
NameBDBM50103360
Synonyms:(3-{[1-(3-Chloro-benzyl)-2-oxo-pyrrolidin-3-yl]-[3-(4-cyano-benzyl)-3H-imidazol-4-ylmethyl]-amino}-propyl)-carbamic acid tert-butyl ester | CHEMBL100661
TypeSmall organic molecule
Emp. Form.C31H37ClN6O3
Mol. Mass.577.117
SMILESCC(C)(C)OC(=O)NCCCN(Cc1cncn1Cc1ccc(cc1)C#N)[C@H]1CCN(Cc2cccc(Cl)c2)C1=O