Reaction Details
TargetCalcium/calmodulin-dependent protein kinase type 1B
LigandBDBM50545576
Substrate/Competitorn/a
Meas. Tech.ChEMBL_1996000 (CHEMBL4629895)
IC50 11±n/a nM
Citation Fromont, CAtzori, AKaur, DHashmi, LGreco, GCabanillas, ANguyen, HVJones, DHGarzón, MVarela, AStevenson, BIacobini, GPLenoir, MRajesh, SBox, CKumar, JGrant, PNovitskaya, VMorgan, JSorrell, FJRedondo, CKramer, AHarris, CJLeighton, BVickers, SPCheetham, SCKenyon, CGrabowska, AMOverduin, MBerditchevski, FWeston, CJKnapp, SFischer, PMButterworth, S Discovery of Highly Selective Inhibitors of Calmodulin-Dependent Kinases That Restore Insulin Sensitivity in the Diet-Induced Obesity  J Med Chem63:6784-6801 (2020) 
 
Calcium/calmodulin-dependent protein kinase type 1B
Name:Calcium/calmodulin-dependent protein kinase type 1B
Type:PROTEIN
Mol. Mass.:38501.47
Organism:Homo sapiens (Human)
Description:ChEMBL_109914
Residue:343
BDBM50545576
NameBDBM50545576
Synonyms:CHEMBL4640712 | US11530193, Example 50
TypeSmall organic molecule
Emp. Form.C24H30N8O
Mol. Mass.446.548
SMILESCC(C)(C#N)c1cc(Nc2nc(ncc2C(N)=O)N2CCC[C@H](N)C2)cc(c1)C(C)(C)C#N