Reaction Details
TargetPeroxisome proliferator-activated receptor delta
LigandBDBM50103940
Substrate/Competitorn/a
Meas. Tech.ChEBML_153720
EC50 630±n/a nM
Citation Liu, KGSmith, JSAyscue, AHHenke, BRLambert, MHLeesnitzer, LMPlunket, KDWillson, TMSternbach, DD Identification of a series of oxadiazole-substituted alpha-isopropoxy phenylpropanoic acids with activity on PPARalpha, PPARgamma, and PPARdelta. Bioorg Med Chem Lett11:2385-8 (2001) Peroxisome proliferator-activated receptor delta
Name:Peroxisome proliferator-activated receptor delta
Type:Enzyme
Mol. Mass.:49910.45
Organism:Homo sapiens (Human)
Description:Q03181
Residue:441
BDBM50103940
NameBDBM50103940
Synonyms:3-(4-((5-(3,5-bis(trifluoromethyl)phenyl)-1,2,4-oxadiazol-3-yl)methoxy)phenyl)-2-isopropoxypropanoic acid CHEMBL307728
TypeSmall organic molecule
Emp. Form.C23H20F6N2O5
Mol. Mass.518.4057
SMILESCC(C)OC(Cc1ccc(OCc2noc(n2)-c2cc(cc(c2)C(F)(F)F)C(F)(F)F)cc1)C(O)=O