Reaction Details
TargetPeroxisome proliferator-activated receptor delta
LigandBDBM50103950
Substrate/Competitorn/a
Meas. Tech.ChEMBL_153498 (CHEMBL760304)
EC50 7900±n/a nM
Citation Liu, KGSmith, JSAyscue, AHHenke, BRLambert, MHLeesnitzer, LMPlunket, KDWillson, TMSternbach, DD Identification of a series of oxadiazole-substituted alpha-isopropoxy phenylpropanoic acids with activity on PPARalpha, PPARgamma, and PPARdelta. Bioorg Med Chem Lett11:2385-8 (2001) Peroxisome proliferator-activated receptor delta
Name:Peroxisome proliferator-activated receptor delta
Type:Enzyme
Mol. Mass.:49910.45
Organism:Homo sapiens (Human)
Description:Q03181
Residue:441
BDBM50103950
NameBDBM50103950
Synonyms:2-Isopropoxy-3-{4-[5-(4-isopropyl-phenyl)-[1,2,4]oxadiazol-3-ylmethoxy]-phenyl}-propionic acid CHEMBL80364
TypeSmall organic molecule
Emp. Form.C24H28N2O5
Mol. Mass.424.4895
SMILESCC(C)OC(Cc1ccc(OCc2noc(n2)-c2ccc(cc2)C(C)C)cc1)C(O)=O